{"text_format":"1","workbook":"xlsx","n_sheets":8,"sheets":["Spielberichtsbogen","Einzelergebnisse","MANNSCHAFTEN+SPIELER","Daten","Etiketten Druck","TV-Beamer","Upload","übertrag"],"not_rendered":{"charts":0,"images":2,"macros":1,"external_links":1,"defined_names":99,"comments":1,"pivot_tables":0},"unopened":[],"bounds":{"document_bytes":16777216,"sheet_cells":100000,"rows_first":2000,"rows_last":500,"rows_between":2000,"halvings":0,"cell_chars":16384,"cell_head_chars":4096},"cells_cut":0,"cells_raw":0,"read":"whole","date_system":"1900"}

{"sheet":"Spielberichtsbogen","index":0,"n_rows":68,"n_cols":27,"rows_kept":68,"cut":false,"hidden":false,"merged":[[1,15,3,26],[9,22,9,25],[6,16,6,18],[9,14,9,15],[66,1,66,26],[13,2,13,4],[17,2,18,4],[23,2,23,4],[27,2,27,4],[9,16,9,18],[25,8,25,9],[32,8,32,9],[31,8,31,9],[30,8,30,9],[28,11,32,11],[30,16,30,18],[28,8,28,9],[29,8,29,9],[28,2,29,4],[20,2,20,4],[45,2,46,4],[49,2,50,4],[37,2,37,4],[48,2,48,4],[57,19,57,22],[68,3,68,6],[67,20,67,26],[67,3,67,6],[67,13,67,17],[68,7,68,11],[23,16,23,18],[24,8,24,9],[30,2,30,4],[35,2,36,4],[34,16,34,18],[34,8,34,9],[44,2,44,4],[31,16,32,18],[41,8,41,9],[36,8,36,9],[47,8,47,9],[31,2,32,4],[41,2,41,4],[42,2,43,4],[38,2,39,4],[34,2,34,4],[57,5,57,9],[47,22,47,23],[48,22,48,23],[45,8,45,9],[46,8,46,9],[42,11,46,11],[37,8,37,9],[38,8,38,9],[68,12,68,16],[68,20,68,26],[55,22,55,23],[54,22,54,23],[35,25,39,25],[42,25,46,25],[44,16,44,18],[35,16,36,18],[42,16,43,18],[45,16,46,18],[38,16,39,18],[38,22,38,23],[36,22,36,23],[41,22,41,23],[43,22,43,23],[42,22,42,23],[46,22,46,23],[44,22,44,23],[45,22,45,23],[52,2,53,4],[52,16,53,18],[52,8,52,9],[51,8,51,9],[53,8,53,9],[51,2,51,4],[48,16,48,18],[49,25,53,25],[49,11,53,11],[49,16,50,18],[52,22,52,23],[53,22,53,23],[51,22,51,23],[50,22,50,23],[49,22,49,23],[51,16,51,18],[41,16,41,18],[39,22,39,23],[40,22,40,23],[37,16,37,18],[28,25,32,25],[21,16,22,18],[28,16,29,18],[27,16,27,18],[24,16,25,18],[22,22,22,23],[30,22,30,23],[29,22,29,23],[27,22,27,23],[31,22,31,23],[21,25,25,25],[16,2,16,4],[19,8,19,9],[21,8,21,9],[22,8,22,9],[16,8,16,9],[14,25,18,25],[14,2,15,4],[14,22,14,23],[23,8,23,9],[21,2,22,4],[24,2,25,4],[35,22,35,23],[24,22,24,23],[35,8,35,9],[34,22,34,23],[18,22,18,23],[19,22,19,23],[28,22,28,23],[33,8,33,9],[32,22,32,23],[33,22,33,23],[20,8,20,9],[21,11,25,11],[27,8,27,9],[26,8,26,9],[35,11,39,11],[37,22,37,23],[4,16,5,25],[3,3,4,10],[16,22,16,23],[16,16,16,18],[14,16,15,18],[14,11,18,11],[14,8,14,9],[15,8,15,9],[6,21,6,22],[6,23,6,24],[6,19,6,20],[13,22,13,23],[17,22,17,23],[11,18,11,25],[17,16,18,18],[17,8,17,9],[11,4,11,11],[13,8,13,9],[65,2,65,26],[64,22,64,26],[64,18,64,20],[64,4,64,6],[64,9,64,13],[6,25,6,26],[13,16,13,18],[20,16,20,18],[15,22,15,23],[21,22,21,23],[18,8,18,9],[20,22,20,23],[25,22,25,23],[26,22,26,23],[23,22,23,23],[54,8,54,9],[39,8,39,9],[40,8,40,9],[43,8,43,9],[48,8,48,9],[49,8,49,9],[50,8,50,9],[42,8,42,9],[44,8,44,9]]}
[]
[null,null,null,null,null,null,null,null,null,null,null,null,null,null,null,"Spielbericht"]
[]
[]
[null,null,null,null,null,null,null,null,null,null,null,null,null,null,null,null,{"$f":"Daten!E5","v":"!!! Liga eintragen !!!"}]
[null,null,null,null,null,"Senioren",null,null,null,null,{"$f":"IF(übertrag!Q11=TRUE,\"X\",\"\")","v":""},null,null,null,"Liga/Klasse"]
{"$rows_left_out":63}
{"sheet":"Einzelergebnisse","index":1,"n_rows":49,"n_cols":13,"rows_kept":49,"cut":false,"hidden":false,"merged":[[46,0,47,0],[46,7,47,7],[44,7,45,7],[38,7,39,7],[38,0,39,0],[20,0,21,0],[30,0,31,0],[22,0,23,0],[28,0,29,0],[44,0,45,0],[1,7,1,12],[1,0,1,5],[4,0,5,0],[4,7,5,7],[36,0,37,0],[30,7,31,7],[28,7,29,7],[22,7,23,7],[36,7,37,7],[20,7,21,7],[12,7,13,7],[14,7,15,7],[6,7,7,7],[6,0,7,0],[12,0,13,0],[14,0,15,0]]}
[]
[{"$f":"Spielberichtsbogen!E12","v":"Heimmannschaft"},null,null,null,null,null,null,{"$f":"Spielberichtsbogen!S12","v":"Gastmannschaft 1"}]
[]
["Name, Vorname","Bahn","Volle","Abr","Fe","Ges",null,"Name, Vorname","Bahn","Volle","Abr","Fe","Ges"]
[{"$f":"Spielberichtsbogen!C15","v":0},1,null,null,null,{"$f":"SUM(C5,D5)","v":0},null,{"$f":"Spielberichtsbogen!Q15","v":0},2,null,null,null,{"$f":"SUM(J5,K5)","v":0}]
[null,2,null,null,null,{"$f":"SUM(C6,D6)","v":0},null,null,1,null,null,null,{"$f":"SUM(J6,K6)","v":0}]
{"$rows_left_out":44}
{"sheet":"MANNSCHAFTEN+SPIELER","index":2,"n_rows":233,"n_cols":22,"rows_kept":233,"cut":false,"hidden":false,"merged":[[0,14,0,20],[0,0,0,6],[3,21,5,26]]}
["Gastmannschaften",null,null,null,null,null,null,null,null,null,null,null,null,null,"Heimmannschaft"]
["KLUB / Verein",null,"Mon/Jahr",null,"Paß-     Nummer",null,"Name, Vorname",null,null,null,null,null,null,null,"KLUB / Verein",null,"Mon/Jahr",null,"Paß-     Nummer",null,"Name, Vorname"]
["Gastmannschaft 1",1,null,1,null,1,null,null,null,null,null,null,null,null,"Heimmannschaft",1,null,1,null,1]
[{"$f":"$A$3","v":"Gastmannschaft 1"},2,null,2,null,2,null,null,null,null,null,null,null,null,{"$f":"$O$3","v":"Heimmannschaft"},2,null,2,null,2,null,"WICHTIG"]
["Gastmannschaft 1",3,null,3,null,3,null,null,null,null,null,null,null,null,"Heimmannschaft",3,null,3,null,3]
["Gastmannschaft 1",4,null,4,null,4,null,null,null,null,null,null,null,null,"Heimmannschaft",4,null,4,null,4]
{"$rows_left_out":228}
{"sheet":"Daten","index":3,"n_rows":37,"n_cols":12,"rows_kept":37,"cut":false,"hidden":false,"merged":[[2,1,2,11],[19,1,21,11],[10,4,10,6],[13,4,13,9],[14,4,14,9],[12,4,12,9],[4,4,4,11],[6,4,6,11],[8,4,8,11]]}
[]
[null,"120 Wurf"]
[null,"gelbe Felder sind Eingabefelder für den Spielbericht"]
[]
[null,null,null,"Liga / Klasse:","!!! Liga eintragen !!!"]
[]
{"$rows_left_out":32}
{"sheet":"Etiketten Druck","index":4,"n_rows":15,"n_cols":11,"rows_kept":15,"cut":false,"hidden":false,"merged":[[0,10,0,13]]}
[null,"AVERY Zweckform",null,"L4732REV",null,"System   Grösse",null,"35,6 x 16,9 mm",null,"2000 Etiketten\n25 Blatt","Seitenränder des Druckbereiches:\nOben und Unten = 1.2 mm\nLinks und Rechts = 1.0 mm"]
["Heim 1",{"$f":"Spielberichtsbogen!C15","v":0},null,{"$f":"Spielberichtsbogen!C15","v":0},null,{"$f":"Spielberichtsbogen!C15","v":0},null,{"$f":"Spielberichtsbogen!C15","v":0}]
["Heim 2",{"$f":"Spielberichtsbogen!C22","v":0},null,{"$f":"Spielberichtsbogen!C22","v":0},null,{"$f":"Spielberichtsbogen!C22","v":0},null,{"$f":"Spielberichtsbogen!C22","v":0}]
["Heim 3",{"$f":"Spielberichtsbogen!C29","v":0},null,{"$f":"Spielberichtsbogen!C29","v":0},null,{"$f":"Spielberichtsbogen!C29","v":0},null,{"$f":"Spielberichtsbogen!C29","v":0}]
["Heim 4",{"$f":"Spielberichtsbogen!C36","v":0},null,{"$f":"Spielberichtsbogen!C36","v":0},null,{"$f":"Spielberichtsbogen!C36","v":0},null,{"$f":"Spielberichtsbogen!C36","v":0}]
["Heim 5",{"$f":"Spielberichtsbogen!C43","v":0},null,{"$f":"Spielberichtsbogen!C43","v":0},null,{"$f":"Spielberichtsbogen!C43","v":0},null,{"$f":"Spielberichtsbogen!C43","v":0}]
{"$rows_left_out":10}
{"sheet":"TV-Beamer","index":5,"n_rows":19,"n_cols":29,"rows_kept":19,"cut":false,"hidden":false,"merged":[[15,1,15,3],[15,22,15,27],[16,1,16,3],[16,22,16,27],[18,2,18,3],[18,24,18,27],[13,22,13,27],[14,1,14,5],[14,7,14,9],[14,11,14,12],[14,13,14,14],[14,16,14,18],[14,20,14,27],[13,1,13,3],[13,8,13,9],[13,11,13,12],[13,13,13,14],[13,16,13,17],[11,22,11,27],[12,1,12,3],[12,8,12,9],[12,11,12,12],[12,13,12,14],[12,16,12,17],[12,22,12,27],[11,1,11,3],[11,8,11,9],[11,11,11,12],[11,13,11,14],[11,16,11,17],[9,22,9,27],[10,1,10,3],[10,8,10,9],[10,11,10,12],[10,13,10,14],[10,16,10,17],[10,22,10,27],[9,1,9,3],[9,8,9,9],[9,11,9,12],[9,13,9,14],[9,16,9,17],[7,22,7,27],[6,0,6,9],[6,16,6,28],[6,10,6,12],[6,13,6,15],[7,16,7,17],[4,14,4,16],[7,1,7,3],[7,8,7,9],[7,11,7,12],[7,13,7,14],[8,22,8,27],[3,2,3,8],[3,9,3,13],[3,14,3,16],[3,17,3,18],[4,17,4,18],[4,2,4,8],[4,9,4,13],[4,25,4,27],[4,19,4,21],[4,22,4,24],[8,1,8,3],[8,8,8,9],[8,11,8,12],[8,13,8,14],[8,16,8,17],[3,22,3,24],[3,19,3,21],[3,25,3,27],[0,1,0,27],[1,1,1,10],[1,11,1,14],[1,15,1,27],[2,2,2,8],[2,25,2,27],[2,14,2,16],[2,17,2,18],[2,9,2,13],[2,19,2,21],[2,22,2,24]]}
[null,{"$f":"Spielberichtsbogen!Q5","v":"!!! Liga eintragen !!!"}]
[null,{"$f":"Spielberichtsbogen!E12","v":"Heimmannschaft"},null,null,null,null,null,null,null,null,null,"gegen",null,null,null,{"$f":"Spielberichtsbogen!S12","v":"Gastmannschaft 1"}]
[null,null,"Mannschaft",null,null,null,null,null,null,"Summe",null,null,null,null,"Volle",null,null,"Abr.",null,"Fehlw.",null,null,"Diff.",null,null,"MP"]
[null,"Heim",{"$f":"B2","v":"Heimmannschaft"},null,null,null,null,null,null,{"$f":"H15","v":0},null,null,null,null,{"$f":"Einzelergebnisse!C9+Einzelergebnisse!C17+Einzelergebnisse!C25+Einzelergebnisse!C33+Einzelergebnisse!C41+Einzelergebnisse!C49","v":0},null,null,{"$f":"Einzelergebnisse!D9+Einzelergebnisse!D17+Einzelergebnisse!D25+Einzelergebnisse!D33+Einzelergebnisse!D41+Einzelergebnisse!D49","v":0},null,{"$f":"Einzelergebnisse!E9+Einzelergebnisse!E17+Einzelergebnisse!E25+Einzelergebnisse!E33+Einzelergebnisse!E41+Einzelergebnisse!E49","v":0},null,null,{"$f":"J4-J5","v":0},null,null,{"$f":"SUM(L9:M15)","v":0}]
[null,"Gast",{"$f":"P2","v":"Gastmannschaft 1"},null,null,null,null,null,null,{"$f":"Q15","v":0},null,null,null,null,{"$f":"Einzelergebnisse!J9+Einzelergebnisse!J17+Einzelergebnisse!J25+Einzelergebnisse!J33+Einzelergebnisse!J41+Einzelergebnisse!J49","v":0},null,null,{"$f":"Einzelergebnisse!K9+Einzelergebnisse!K17+Einzelergebnisse!K25+Einzelergebnisse!K33+Einzelergebnisse!K41+Einzelergebnisse!K49","v":0},null,{"$f":"Einzelergebnisse!L9+Einzelergebnisse!L17+Einzelergebnisse!L25+Einzelergebnisse!L33+Einzelergebnisse!L41+Einzelergebnisse!L49","v":0},null,null,null,null,null,{"$f":"SUM(N9:O15)","v":0}]
[]
{"$rows_left_out":14}
{"sheet":"Upload","index":6,"n_rows":68,"n_cols":27,"rows_kept":68,"cut":false,"hidden":false,"merged":[[65,2,65,26],[66,1,66,26],[67,3,67,6],[67,13,67,17],[67,20,67,26],[68,3,68,6],[68,7,68,11],[68,12,68,16],[68,20,68,26],[54,8,54,9],[54,22,54,23],[55,22,55,23],[57,5,57,9],[57,19,57,22],[64,4,64,6],[64,9,64,13],[64,18,64,20],[64,22,64,26],[49,25,53,25],[50,8,50,9],[50,22,50,23],[51,2,51,4],[51,8,51,9],[47,8,47,9],[47,22,47,23],[48,2,48,4],[48,8,48,9],[48,16,48,18],[48,22,48,23],[51,16,51,18],[51,22,51,23],[52,2,53,4],[52,8,52,9],[52,16,53,18],[52,22,52,23],[53,8,53,9],[53,22,53,23],[49,2,50,4],[49,8,49,9],[49,11,53,11],[49,16,50,18],[49,22,49,23],[42,25,46,25],[43,8,43,9],[43,22,43,23],[44,2,44,4],[44,8,44,9],[40,8,40,9],[40,22,40,23],[41,2,41,4],[41,8,41,9],[41,16,41,18],[41,22,41,23],[44,16,44,18],[44,22,44,23],[45,2,46,4],[45,8,45,9],[45,16,46,18],[45,22,45,23],[46,8,46,9],[46,22,46,23],[42,2,43,4],[42,8,42,9],[42,11,46,11],[42,16,43,18],[42,22,42,23],[35,25,39,25],[36,8,36,9],[36,22,36,23],[37,2,37,4],[37,8,37,9],[33,8,33,9],[33,22,33,23],[34,2,34,4],[34,8,34,9],[34,16,34,18],[34,22,34,23],[37,16,37,18],[37,22,37,23],[38,2,39,4],[38,8,38,9],[38,16,39,18],[38,22,38,23],[39,8,39,9],[39,22,39,23],[35,2,36,4],[35,8,35,9],[35,11,39,11],[35,16,36,18],[35,22,35,23],[28,25,32,25],[29,8,29,9],[29,22,29,23],[30,2,30,4],[30,8,30,9],[26,8,26,9],[26,22,26,23],[27,2,27,4],[27,8,27,9],[27,16,27,18],[27,22,27,23],[30,16,30,18],[30,22,30,23],[31,2,32,4],[31,8,31,9],[31,16,32,18],[31,22,31,23],[32,8,32,9],[32,22,32,23],[28,2,29,4],[28,8,28,9],[28,11,32,11],[28,16,29,18],[28,22,28,23],[21,25,25,25],[22,8,22,9],[22,22,22,23],[23,2,23,4],[23,8,23,9],[19,8,19,9],[19,22,19,23],[20,2,20,4],[20,8,20,9],[20,16,20,18],[20,22,20,23],[23,16,23,18],[23,22,23,23],[24,2,25,4],[24,8,24,9],[24,16,25,18],[24,22,24,23],[25,8,25,9],[25,22,25,23],[21,2,22,4],[21,8,21,9],[21,11,25,11],[21,16,22,18],[21,22,21,23],[9,14,9,15],[9,16,9,18],[9,22,9,25],[17,2,18,4],[17,8,17,9],[17,16,18,18],[17,22,17,23],[18,8,18,9],[18,22,18,23],[14,2,15,4],[14,8,14,9],[14,11,18,11],[14,16,15,18],[14,22,14,23],[16,2,16,4],[16,8,16,9],[1,15,1,18],[1,19,1,26],[2,15,2,18],[2,19,2,26],[14,25,18,25],[15,8,15,9],[15,22,15,23],[3,3,4,10],[3,15,3,18],[3,19,3,26],[4,16,5,25],[6,16,6,18],[6,19,6,20],[6,21,6,22],[6,23,6,24],[6,25,6,26],[11,4,11,11],[11,18,11,25],[13,2,13,4],[13,8,13,9],[13,16,13,18],[13,22,13,23],[16,16,16,18],[16,22,16,23]]}
[]
[]
[]
[null,null,null,"Spielbericht"]
[null,null,null,null,null,null,null,null,null,null,null,null,null,null,null,null,"!!! Liga eintragen !!!"]
[null,null,null,null,null,"Senioren",null,null,null,null,"",null,null,null,"Liga/Klasse"]
{"$rows_left_out":63}
{"sheet":"übertrag","index":7,"n_rows":117,"n_cols":31,"rows_kept":117,"cut":false,"hidden":true,"merged":[[0,16,0,17]]}
[null,null,null,null,null,null,null,null,null,null,"Spieler 1 - 6","Spieler 7 - 12","geb.jahr 1 - 6","geb.jahr 7 - 12 - 6","paß.Nr 1 - 6","paß.Nr 7 - 12","Eingane der Kreuze",null,null,null,null,"Gastmannschaft",null,"Heim",null,null,null,null,null,null,"Spieltag"]
[13,9,9,13,null,4,null,1,1,null,{"$f":"IF(übertrag!$H$2=1,VLOOKUP(übertrag!I2,einsü,2,),IF($H$2=2,VLOOKUP(übertrag!I2,zweiü,2,),IF($H$2=3,VLOOKUP(übertrag!I2,dreiü,2,),IF($H$2=4,VLOOKUP(übertrag!I2,vierü,2,),IF($H$2=5,VLOOKUP(übertrag!I2,fünfü,2,),IF($H$2=6,VLOOKUP(übertrag!I2,sechsü,2,),\"\"))))))","v":0},{"$f":"IF(übertrag!$H$2=7,VLOOKUP(übertrag!I2,siebenü,2,),IF($H$2=8,VLOOKUP(übertrag!I2,achtü,2,),IF($H$2=9,VLOOKUP(übertrag!I2,neunü,2,),IF($H$2=10,VLOOKUP(übertrag!I2,zehnü,2,),IF($H$2=11,VLOOKUP(übertrag!I2,elfü,2,),IF($H$2=12,VLOOKUP(übertrag!I2,Heimü,2,),\"\"))))))","v":""},{"$f":"IF(übertrag!$H$2=1,VLOOKUP(übertrag!I2,_jhg1,2,),IF($H$2=2,VLOOKUP(übertrag!I2,_jhg2,2,),IF($H$2=3,VLOOKUP(übertrag!I2,_jhg3,2,),IF($H$2=4,VLOOKUP(übertrag!I2,_jhg4,2,),IF($H$2=5,VLOOKUP(übertrag!I2,_jhg5,2,),IF($H$2=6,VLOOKUP(übertrag!I2,_jhg6,2,),\"\"))))))","v":0},{"$f":"IF(übertrag!$H$2=7,VLOOKUP(übertrag!I2,_jhg7,2,),IF($H$2=8,VLOOKUP(übertrag!I2,_jhg8,2,),IF($H$2=9,VLOOKUP(übertrag!I2,_jhg9,2,),IF($H$2=10,VLOOKUP(übertrag!I2,_jhg10,2,),IF($H$2=11,VLOOKUP(übertrag!I2,_jhg11,2,),IF($H$2=12,VLOOKUP(übertrag!I2,jhgheim,2,),\"\"))))))","v":""},{"$f":"IF(übertrag!$H$2=1,VLOOKUP(übertrag!I2,paß1,2,),IF($H$2=2,VLOOKUP(übertrag!I2,paß2,2,),IF($H$2=3,VLOOKUP(übertrag!I2,paß3,2,),IF($H$2=4,VLOOKUP(übertrag!I2,paß4,2,),IF($H$2=5,VLOOKUP(übertrag!I2,paß5,2,),IF($H$2=6,VLOOKUP(übertrag!I2,paß6,2,),\"\"))))))","v":0},{"$f":"IF(übertrag!$H$2=7,VLOOKUP(übertrag!I2,paß7,2,),IF($H$2=8,VLOOKUP(übertrag!I2,paß8,2,),IF($H$2=9,VLOOKUP(übertrag!I2,paß9,2,),IF($H$2=10,VLOOKUP(übertrag!I2,paß10,2,),IF($H$2=11,VLOOKUP(übertrag!I2,paß11,2,),IF($H$2=12,VLOOKUP(übertrag!I2,paßheim,2,),\"\"))))))","v":""},false,false,null,null,1,{"$f":"'MANNSCHAFTEN+SPIELER'!A3","v":"Gastmannschaft 1"},null,null,null,{"$f":"IF(I16,VLOOKUP(übertrag!I16,Heimü,2,),\"\")","v":0},null,null,null,null,1]
[13,1,null,13,null,null,null,null,1,null,{"$f":"IF(übertrag!$H$2=1,VLOOKUP(übertrag!I3,einsü,2,),IF($H$2=2,VLOOKUP(übertrag!I3,zweiü,2,),IF($H$2=3,VLOOKUP(übertrag!I3,dreiü,2,),IF($H$2=4,VLOOKUP(übertrag!I3,vierü,2,),IF($H$2=5,VLOOKUP(übertrag!I3,fünfü,2,),IF($H$2=6,VLOOKUP(übertrag!I3,sechsü,2,),\"\"))))))","v":0},{"$f":"IF(übertrag!$H$2=7,VLOOKUP(übertrag!I3,siebenü,2,),IF($H$2=8,VLOOKUP(übertrag!I3,achtü,2,),IF($H$2=9,VLOOKUP(übertrag!I3,neunü,2,),IF($H$2=10,VLOOKUP(übertrag!I3,zehnü,2,),IF($H$2=11,VLOOKUP(übertrag!I3,elfü,2,),IF($H$2=12,VLOOKUP(übertrag!I3,Heimü,2,),\"\"))))))","v":""},{"$f":"IF(übertrag!$H$2=1,VLOOKUP(übertrag!I3,_jhg1,2,),IF($H$2=2,VLOOKUP(übertrag!I3,_jhg2,2,),IF($H$2=3,VLOOKUP(übertrag!I3,_jhg3,2,),IF($H$2=4,VLOOKUP(übertrag!I3,_jhg4,2,),IF($H$2=5,VLOOKUP(übertrag!I3,_jhg5,2,),IF($H$2=6,VLOOKUP(übertrag!I3,_jhg6,2,),\"\"))))))","v":0},{"$f":"IF(übertrag!$H$2=7,VLOOKUP(übertrag!I3,_jhg7,2,),IF($H$2=8,VLOOKUP(übertrag!I3,_jhg8,2,),IF($H$2=9,VLOOKUP(übertrag!I3,_jhg9,2,),IF($H$2=10,VLOOKUP(übertrag!I3,_jhg10,2,),IF($H$2=11,VLOOKUP(übertrag!I3,_jhg11,2,),IF($H$2=12,VLOOKUP(übertrag!I3,jhgheim,2,),\"\"))))))","v":""},{"$f":"IF(übertrag!$H$2=1,VLOOKUP(übertrag!I3,paß1,2,),IF($H$2=2,VLOOKUP(übertrag!I3,paß2,2,),IF($H$2=3,VLOOKUP(übertrag!I3,paß3,2,),IF($H$2=4,VLOOKUP(übertrag!I3,paß4,2,),IF($H$2=5,VLOOKUP(übertrag!I3,paß5,2,),IF($H$2=6,VLOOKUP(übertrag!I3,paß6,2,),\"\"))))))","v":0},{"$f":"IF(übertrag!$H$2=7,VLOOKUP(übertrag!I3,paß7,2,),IF($H$2=8,VLOOKUP(übertrag!I3,paß8,2,),IF($H$2=9,VLOOKUP(übertrag!I3,paß9,2,),IF($H$2=10,VLOOKUP(übertrag!I3,paß10,2,),IF($H$2=11,VLOOKUP(übertrag!I3,paß11,2,),IF($H$2=12,VLOOKUP(übertrag!I3,paßheim,2,),\"\"))))))","v":""},false,false,null,null,2,{"$f":"'MANNSCHAFTEN+SPIELER'!A24","v":"Gastmannschaft 2"},null,null,null,{"$f":"IF(I17,VLOOKUP(übertrag!I17,Heimü,2,),\"\")","v":0},null,null,null,null,2]
[13,9,9,13,null,null,null,null,1,null,{"$f":"IF(übertrag!$H$2=1,VLOOKUP(übertrag!I4,einsü,2,),IF($H$2=2,VLOOKUP(übertrag!I4,zweiü,2,),IF($H$2=3,VLOOKUP(übertrag!I4,dreiü,2,),IF($H$2=4,VLOOKUP(übertrag!I4,vierü,2,),IF($H$2=5,VLOOKUP(übertrag!I4,fünfü,2,),IF($H$2=6,VLOOKUP(übertrag!I4,sechsü,2,),\"\"))))))","v":0},{"$f":"IF(übertrag!$H$2=7,VLOOKUP(übertrag!I4,siebenü,2,),IF($H$2=8,VLOOKUP(übertrag!I4,achtü,2,),IF($H$2=9,VLOOKUP(übertrag!I4,neunü,2,),IF($H$2=10,VLOOKUP(übertrag!I4,zehnü,2,),IF($H$2=11,VLOOKUP(übertrag!I4,elfü,2,),IF($H$2=12,VLOOKUP(übertrag!I4,Heimü,2,),\"\"))))))","v":""},{"$f":"IF(übertrag!$H$2=1,VLOOKUP(übertrag!I4,_jhg1,2,),IF($H$2=2,VLOOKUP(übertrag!I4,_jhg2,2,),IF($H$2=3,VLOOKUP(übertrag!I4,_jhg3,2,),IF($H$2=4,VLOOKUP(übertrag!I4,_jhg4,2,),IF($H$2=5,VLOOKUP(übertrag!I4,_jhg5,2,),IF($H$2=6,VLOOKUP(übertrag!I4,_jhg6,2,),\"\"))))))","v":0},{"$f":"IF(übertrag!$H$2=7,VLOOKUP(übertrag!I4,_jhg7,2,),IF($H$2=8,VLOOKUP(übertrag!I4,_jhg8,2,),IF($H$2=9,VLOOKUP(übertrag!I4,_jhg9,2,),IF($H$2=10,VLOOKUP(übertrag!I4,_jhg10,2,),IF($H$2=11,VLOOKUP(übertrag!I4,_jhg11,2,),IF($H$2=12,VLOOKUP(übertrag!I4,jhgheim,2,),\"\"))))))","v":""},{"$f":"IF(übertrag!$H$2=1,VLOOKUP(übertrag!I4,paß1,2,),IF($H$2=2,VLOOKUP(übertrag!I4,paß2,2,),IF($H$2=3,VLOOKUP(übertrag!I4,paß3,2,),IF($H$2=4,VLOOKUP(übertrag!I4,paß4,2,),IF($H$2=5,VLOOKUP(übertrag!I4,paß5,2,),IF($H$2=6,VLOOKUP(übertrag!I4,paß6,2,),\"\"))))))","v":0},{"$f":"IF(übertrag!$H$2=7,VLOOKUP(übertrag!I4,paß7,2,),IF($H$2=8,VLOOKUP(übertrag!I4,paß8,2,),IF($H$2=9,VLOOKUP(übertrag!I4,paß9,2,),IF($H$2=10,VLOOKUP(übertrag!I4,paß10,2,),IF($H$2=11,VLOOKUP(übertrag!I4,paß11,2,),IF($H$2=12,VLOOKUP(übertrag!I4,paßheim,2,),\"\"))))))","v":""},false,null,null,null,3,{"$f":"'MANNSCHAFTEN+SPIELER'!A45","v":"Gastmannschaft 3"},null,null,null,{"$f":"IF(I18,VLOOKUP(übertrag!I18,Heimü,2,),\"\")","v":0},null,null,null,null,3]
[13,1,null,13,null,null,null,null,1,null,{"$f":"IF(übertrag!$H$2=1,VLOOKUP(übertrag!I5,einsü,2,),IF($H$2=2,VLOOKUP(übertrag!I5,zweiü,2,),IF($H$2=3,VLOOKUP(übertrag!I5,dreiü,2,),IF($H$2=4,VLOOKUP(übertrag!I5,vierü,2,),IF($H$2=5,VLOOKUP(übertrag!I5,fünfü,2,),IF($H$2=6,VLOOKUP(übertrag!I5,sechsü,2,),\"\"))))))","v":0},{"$f":"IF(übertrag!$H$2=7,VLOOKUP(übertrag!I5,siebenü,2,),IF($H$2=8,VLOOKUP(übertrag!I5,achtü,2,),IF($H$2=9,VLOOKUP(übertrag!I5,neunü,2,),IF($H$2=10,VLOOKUP(übertrag!I5,zehnü,2,),IF($H$2=11,VLOOKUP(übertrag!I5,elfü,2,),IF($H$2=12,VLOOKUP(übertrag!I5,Heimü,2,),\"\"))))))","v":""},{"$f":"IF(übertrag!$H$2=1,VLOOKUP(übertrag!I5,_jhg1,2,),IF($H$2=2,VLOOKUP(übertrag!I5,_jhg2,2,),IF($H$2=3,VLOOKUP(übertrag!I5,_jhg3,2,),IF($H$2=4,VLOOKUP(übertrag!I5,_jhg4,2,),IF($H$2=5,VLOOKUP(übertrag!I5,_jhg5,2,),IF($H$2=6,VLOOKUP(übertrag!I5,_jhg6,2,),\"\"))))))","v":0},{"$f":"IF(übertrag!$H$2=7,VLOOKUP(übertrag!I5,_jhg7,2,),IF($H$2=8,VLOOKUP(übertrag!I5,_jhg8,2,),IF($H$2=9,VLOOKUP(übertrag!I5,_jhg9,2,),IF($H$2=10,VLOOKUP(übertrag!I5,_jhg10,2,),IF($H$2=11,VLOOKUP(übertrag!I5,_jhg11,2,),IF($H$2=12,VLOOKUP(übertrag!I5,jhgheim,2,),\"\"))))))","v":""},{"$f":"IF(übertrag!$H$2=1,VLOOKUP(übertrag!I5,paß1,2,),IF($H$2=2,VLOOKUP(übertrag!I5,paß2,2,),IF($H$2=3,VLOOKUP(übertrag!I5,paß3,2,),IF($H$2=4,VLOOKUP(übertrag!I5,paß4,2,),IF($H$2=5,VLOOKUP(übertrag!I5,paß5,2,),IF($H$2=6,VLOOKUP(übertrag!I5,paß6,2,),\"\"))))))","v":0},{"$f":"IF(übertrag!$H$2=7,VLOOKUP(übertrag!I5,paß7,2,),IF($H$2=8,VLOOKUP(übertrag!I5,paß8,2,),IF($H$2=9,VLOOKUP(übertrag!I5,paß9,2,),IF($H$2=10,VLOOKUP(übertrag!I5,paß10,2,),IF($H$2=11,VLOOKUP(übertrag!I5,paß11,2,),IF($H$2=12,VLOOKUP(übertrag!I5,paßheim,2,),\"\"))))))","v":""},false,null,null,null,4,{"$f":"'MANNSCHAFTEN+SPIELER'!A66","v":"Gastmannschaft 4"},null,null,null,{"$f":"IF(I19,VLOOKUP(übertrag!I19,Heimü,2,),\"\")","v":0},null,null,null,null,4]
[13,9,9,13,null,null,null,null,1,null,{"$f":"IF(übertrag!$H$2=1,VLOOKUP(übertrag!I6,einsü,2,),IF($H$2=2,VLOOKUP(übertrag!I6,zweiü,2,),IF($H$2=3,VLOOKUP(übertrag!I6,dreiü,2,),IF($H$2=4,VLOOKUP(übertrag!I6,vierü,2,),IF($H$2=5,VLOOKUP(übertrag!I6,fünfü,2,),IF($H$2=6,VLOOKUP(übertrag!I6,sechsü,2,),\"\"))))))","v":0},{"$f":"IF(übertrag!$H$2=7,VLOOKUP(übertrag!I6,siebenü,2,),IF($H$2=8,VLOOKUP(übertrag!I6,achtü,2,),IF($H$2=9,VLOOKUP(übertrag!I6,neunü,2,),IF($H$2=10,VLOOKUP(übertrag!I6,zehnü,2,),IF($H$2=11,VLOOKUP(übertrag!I6,elfü,2,),IF($H$2=12,VLOOKUP(übertrag!I6,Heimü,2,),\"\"))))))","v":""},{"$f":"IF(übertrag!$H$2=1,VLOOKUP(übertrag!I6,_jhg1,2,),IF($H$2=2,VLOOKUP(übertrag!I6,_jhg2,2,),IF($H$2=3,VLOOKUP(übertrag!I6,_jhg3,2,),IF($H$2=4,VLOOKUP(übertrag!I6,_jhg4,2,),IF($H$2=5,VLOOKUP(übertrag!I6,_jhg5,2,),IF($H$2=6,VLOOKUP(übertrag!I6,_jhg6,2,),\"\"))))))","v":0},{"$f":"IF(übertrag!$H$2=7,VLOOKUP(übertrag!I6,_jhg7,2,),IF($H$2=8,VLOOKUP(übertrag!I6,_jhg8,2,),IF($H$2=9,VLOOKUP(übertrag!I6,_jhg9,2,),IF($H$2=10,VLOOKUP(übertrag!I6,_jhg10,2,),IF($H$2=11,VLOOKUP(übertrag!I6,_jhg11,2,),IF($H$2=12,VLOOKUP(übertrag!I6,jhgheim,2,),\"\"))))))","v":""},{"$f":"IF(übertrag!$H$2=1,VLOOKUP(übertrag!I6,paß1,2,),IF($H$2=2,VLOOKUP(übertrag!I6,paß2,2,),IF($H$2=3,VLOOKUP(übertrag!I6,paß3,2,),IF($H$2=4,VLOOKUP(übertrag!I6,paß4,2,),IF($H$2=5,VLOOKUP(übertrag!I6,paß5,2,),IF($H$2=6,VLOOKUP(übertrag!I6,paß6,2,),\"\"))))))","v":0},{"$f":"IF(übertrag!$H$2=7,VLOOKUP(übertrag!I6,paß7,2,),IF($H$2=8,VLOOKUP(übertrag!I6,paß8,2,),IF($H$2=9,VLOOKUP(übertrag!I6,paß9,2,),IF($H$2=10,VLOOKUP(übertrag!I6,paß10,2,),IF($H$2=11,VLOOKUP(übertrag!I6,paß11,2,),IF($H$2=12,VLOOKUP(übertrag!I6,paßheim,2,),\"\"))))))","v":""},false,null,null,null,5,{"$f":"'MANNSCHAFTEN+SPIELER'!A87","v":"Gastmannschaft 5"},null,null,null,{"$f":"IF(I20,VLOOKUP(übertrag!I20,Heimü,2,),\"\")","v":0},null,null,null,null,5]
{"$rows_left_out":111}